Trifluoromethanesulfinyl cyanide

Phase change data

Data compiled by: William E. Acree, Jr., James S. Chickos

Enthalpy of vaporization

ΔvapH (kcal/mol) Temperature (K) Method Reference
9.61352.IBurton and Shreeve, 1977

References

Burton and Shreeve, 1977
Burton, Craig A.; Shreeve, Jean'ne M., Trifluoromethanesulfinate esters, Inorg. Chem., 1977, 16, 5, 1039-1042, https://doi.org/10.1021/ic50171a015 . [all data]