3-Ethylbenzoic acid

Gas phase thermochemistry data

Data compiled by: Hussein Y. Afeefy, Joel F. Liebman, and Stephen E. Stein

Quantity Value Units Method Reference Comment
Δfgas-82.89 ± 0.35kcal/molCcbColomina, Jimenez, et al., 1976

Condensed phase thermochemistry data

Data compiled as indicated in comments:
ALS - Hussein Y. Afeefy, Joel F. Liebman, and Stephen E. Stein
DH - Eugene S. Domalski and Elizabeth D. Hearing

Quantity Value Units Method Reference Comment
Δfsolid-106.58 ± 0.34kcal/molCcbColomina, Jimenez, et al., 1976ALS
Quantity Value Units Method Reference Comment
Δcsolid-1081.47 ± 0.75kcal/molCcbColomina, Jimenez, et al., 1976Corresponding Δfsolid = -106.57 kcal/mol (simple calculation by NIST; no Washburn corrections); ALS

Constant pressure heat capacity of solid

Cp,solid (cal/mol*K) Temperature (K) Reference Comment
47.73298.15Colomina, Jimenez, et al., 1984Cp given as 1.33 J/g*K.; DH

References

Colomina, Jimenez, et al., 1976
Colomina, M.; Jimenez, P.; Perez-Ossorio, R.; Turrion, C., Thermochemical properties of alkylbenzoic acids VI. Enthalpies of combustion and formation of the o-, m-, and p-ethylbenzoic acids, J. Chem. Thermodyn., 1976, 8, 439-444. [all data]

Colomina, Jimenez, et al., 1984
Colomina, M.; Jimenez, P.; Roux, M.V.; Turrion, C., Thermochemical properties of benzoic acid derivatives. XI. Vapour pressures and enthalpies of sublimation and formation of the six dimethylbenzoic acids, J. Chem. Thermodyn., 1984, 16, 1121-1127. [all data]