Phenol, 2-chloro-4-nitro-

Phase change data

Data compiled as indicated in comments:
TRC - Thermodynamics Research Center, NIST Boulder Laboratories, Chris Muzny director
AC - William E. Acree, Jr., James S. Chickos

Quantity Value Units Method Reference Comment
Tfus385.KN/ASmith, Applegate, et al., 1961Uncertainty assigned by TRC = 1. K; TRC
Quantity Value Units Method Reference Comment
Δsub99.0 ± 2.1kJ/molCMorais, Miranda, et al., 2007AC

Enthalpy of fusion

ΔfusH (kJ/mol) Temperature (K) Reference Comment
20.88380.7Morais, Miranda, et al., 2007AC

In addition to the Thermodynamics Research Center (TRC) data available from this site, much more physical and chemical property data is available from the following TRC products:

References

Smith, Applegate, et al., 1961
Smith, M.A.; Applegate, V.C.; Johnson, B.G.H., Physical Properties of Some Halo-Nitrophenols, J. Chem. Eng. Data, 1961, 6, 607. [all data]

Morais, Miranda, et al., 2007
Morais, Victor M.F.; Miranda, Margarida S.; Matos, M. Agostinha R., Thermochemical Parameters of the Chloronitrophenol Isomers: A Combined Experimental and Theoretical Investigation, J. Chem. Eng. Data, 2007, 52, 2, 627-634, https://doi.org/10.1021/je6005218 . [all data]