5-Methyl-2-pyrazinylmethanol

Normal alkane RI, polar column, temperature ramp

View large format table.

Column type Active phase I Reference Comment
CapillaryDB-Wax2075.Osada and Shibamoto, 2006He, 60. C @ 5. min, 2. K/min, 180. C @ 30. min; Column length: 30. m; Column diameter: 0.25 mm

References

Osada and Shibamoto, 2006
Osada, Y.; Shibamoto, T., Antioxidative activity of volatile extracts from Maillard model systems, Food Chem., 2006, 98, 3, 522-528, https://doi.org/10.1016/j.foodchem.2005.05.084 . [all data]