2,2,4,6-tetramethylheptane

Phase change data

Data compiled by: Thermodynamics Research Center, NIST Boulder Laboratories, Chris Muzny director

Quantity Value Units Method Reference Comment
Tboil435.4KN/AMoersch and Whitmore, 1949Uncertainty assigned by TRC = 1. K
Tboil435.1KN/AFenske, Braun, et al., 1947Uncertainty assigned by TRC = 0.5 K

In addition to the Thermodynamics Research Center (TRC) data available from this site, much more physical and chemical property data is available from the following TRC products:

References

Moersch and Whitmore, 1949
Moersch, G.W.; Whitmore, F.C., Hydrocarbons: ix 2,2,4-trimethylheptane, 2,2,4-trimethyloctane, 2,2,4,6- tetramethylheptane and 2,2,4,5,5-pentamethylhexane, J. Am. Chem. Soc., 1949, 71, 819-21. [all data]

Fenske, Braun, et al., 1947
Fenske, M.R.; Braun, W.G.; Wiegand, R.V.; Quiggle, D.; McCormick, R.H.; Rank, D.H., Raman Spectra of Hydrocarbons, Anal. Chem., 1947, 19, 700. [all data]