2-Methylhexadec-1-ene

Van Den Dool and Kratz RI, non-polar column, custom temperature program

View large format table.

Column type Active phase I Reference Comment
CapillaryDB-51689.Zaikin and Borisov, 2002He; Column length: 30. m; Column diameter: 0.25 mm; Program: 30C => 5K/min=120C => 10C/min => 270C

Normal alkane RI, non-polar column, temperature ramp

View large format table.

Column type Active phase I Reference Comment
CapillaryCP Sil 8 CB1685.Yruela, Barbe, et al., 199025. m/0.20 mm/0.13 μm, H2, 6. K/min; Tstart: 60. C; Tend: 300. C

References

Zaikin and Borisov, 2002
Zaikin, V.G.; Borisov, R.S., Chromatographic-mass spectrometric analysis of Fishcer-Tropsch synthesis products, J. Anal. Chem. USSR (Engl. Transl.), 2002, 57, 6, 544-551. [all data]

Yruela, Barbe, et al., 1990
Yruela, I.; Barbe, A.; Grimalt, J.O., Determination of Double Bond Position and Geometry in Linear and High Branched Hydrocarbons and Fatty Acids from Gas Chromatography-Mass Spectrometry of Epoxides and Diols Generated by Stereospecific Resin Hydration, J. Chromatogr. Sci., 1990, 28, 8, 421-427, https://doi.org/10.1093/chromsci/28.8.421 . [all data]