Benzenesulfinic-acid-

Reaction thermochemistry data

Data compiled by: Hussein Y. Afeefy, Joel F. Liebman, and Stephen E. Stein

Individual Reactions

Diphenyl disulfone + Water = Benzenesulfinic-acid- + Benzenesulfonic acid

By formula: C12H10O4S2 + H2O = C6H6O2S + C6H6O3S

Quantity Value Units Method Reference Comment
Δr-16.2 ± 2.5kcal/molCmKice, Margolis, et al., 1977solid phase; solvent: Water; Hydrolysis

Water + Phenyl benzenesulfinyl sulfone = 2Benzenesulfinic-acid-

By formula: H2O + C12H10O3S2 = 2C6H6O2S

Quantity Value Units Method Reference Comment
Δr-1.5 ± 2.1kcal/molCmKice, Margolis, et al., 1977solid phase; solvent: Water; Hydrolysis

References

Kice, Margolis, et al., 1977
Kice, J.L.; Margolis, H.C.; Johnson, W.S.; Wulff, C.A., Heats of hydrolysis of phenyl α-disulfone and phenyl benzenesulfinyl sulfone, J. Org. Chem., 1977, 42, 2933-2935. [all data]