alpha.-Methylbenzylamine

Phase change data

Data compiled as indicated in comments:
BS - Robert L. Brown and Stephen E. Stein
AC - William E. Acree, Jr., James S. Chickos

Quantity Value Units Method Reference Comment
Δvap13.0 ± 0.02kcal/molCAtik, Saito, et al., 1987AC

Reduced pressure boiling point

Tboil (K) Pressure (atm) Reference Comment
458.20.995Aldrich Chemical Company Inc., 1990BS

Enthalpy of vaporization

ΔvapH (kcal/mol) Temperature (K) Method Reference Comment
8.77305.AStephenson and Malanowski, 1987Based on data from 292. - 318. K.; AC

References

Atik, Saito, et al., 1987
Atik, Zadjia; Saito, Yoshihiro; Kusano, Kazuhito, Thermodynamic properties of liquid enantiomers I. Enthalpies of vaporization of fenchones, α-methylbenzylamines, and limonenes at 298.15 K, The Journal of Chemical Thermodynamics, 1987, 19, 1, 99-102, https://doi.org/10.1016/0021-9614(87)90167-4 . [all data]

Aldrich Chemical Company Inc., 1990
Aldrich Chemical Company Inc., Catalog Handbook of Fine Chemicals, Aldrich Chemical Company, Inc., Milwaukee WI, 1990, 1. [all data]

Stephenson and Malanowski, 1987
Stephenson, Richard M.; Malanowski, Stanislaw, Handbook of the Thermodynamics of Organic Compounds, 1987, https://doi.org/10.1007/978-94-009-3173-2 . [all data]