1-Propanol, 3-phenoxy-

Van Den Dool and Kratz RI, non-polar column, temperature ramp

View large format table.

Column type Active phase I Reference Comment
CapillaryVF-5MS1371.Zheng, 201130. m/0.25 mm/0.25 μm, He; Tstart: 60. C; Tend: 270. C

Normal alkane RI, polar column, custom temperature program

View large format table.

Column type Active phase I Reference Comment
CapillarySupelko CO Wax2063.Vekiari, Orepoulou, et al., 201060. m/0.32 mm/0.25 μm, Helium; Program: 40 0C (5 min) 4 0C/min -> 75 0C 5 0C/min -> 250 0C (10 min)

References

Zheng, 2011
Zheng, Yufang, Retention Data. NIST Mass Spectrometry Data Center., NIST Mass Spectrometry Data Center, 2011. [all data]

Vekiari, Orepoulou, et al., 2010
Vekiari, S.A.; Orepoulou, V.; Kourkoutas, Y.; Kamoun, N.; Msallem, M.; Psimouli, V.; Arapoglou, D., Characterization and seasonal variations of the quality of virgin olive oil of the Thoumbolia and Koroneiki varieties from Southern Greece, Grasas y Aceites, 2010, 61, 3, 221-231, https://doi.org/10.3989/gya.108709 . [all data]