2-Furancarbonitrile

Gas phase ion energetics data

Data compiled as indicated in comments:
LL - Sharon G. Lias and Joel F. Liebman
LLK - Sharon G. Lias, Rhoda D. Levin, and Sherif A. Kafafi

Ionization energy determinations

IE (eV) Method Reference Comment
9.45PEKlapstein, MacPherson, et al., 1990LL
9.77 ± 0.05EILinda, Marino, et al., 1971LLK
9.47 ± 0.05PEFringuelli, Marino, et al., 1976Vertical value; LLK

References

Klapstein, MacPherson, et al., 1990
Klapstein, D.; MacPherson, C.D.; O'Brien, R.T., The photoelectron spectra and electronic structure of 2-carbonyl furans, Can. J. Chem., 1990, 68, 747. [all data]

Linda, Marino, et al., 1971
Linda, P.; Marino, G.; Pignataro, S., A comparison of sensitivities to substituent effects of five- membered heteroaromatic rings in gas phase ionization, J. Chem. Soc. B, 1971, 1585. [all data]

Fringuelli, Marino, et al., 1976
Fringuelli, F.; Marino, G.; Taticchi, A.; Distefano, G.; Colonna, F.P.; Pignataro, S., Photoelectron spectra of the α-substituted derivatives of furan, thiophen, selenophen, and tellurophen. A comparative study of the molecular orbital energies, J. Chem. Soc. Perkin Trans. 2, 1976, 276. [all data]