3-Penten-1-yne, 4-methyl-3-(1-methylethyl)-

Gas phase ion energetics data

Data compiled by: Sharon G. Lias, Rhoda D. Levin, and Sherif A. Kafafi

Ionization energy determinations

IE (eV) Method Reference
8.26 ± 0.01PECarlier, Mouvier, et al., 1979

References

Carlier, Mouvier, et al., 1979
Carlier, P.; Mouvier, G.; Mesnard, D.; Miginiac, L., Etude par spectrometrie de photoelectrons de la structure electronique des phenyl-alcynes conjugues, J. Electron Spectrosc. Relat. Phenom., 1979, 16, 147. [all data]