Tricyclo[4.1.0.02,7]hept-3-ene,1,6-dimethyl-

Gas phase ion energetics data

Data compiled by: Sharon G. Lias, Rhoda D. Levin, and Sherif A. Kafafi

Ionization energy determinations

IE (eV) Method Reference Comment
8.30PEBischof, Gleiter, et al., 1978Vertical value

References

Bischof, Gleiter, et al., 1978
Bischof, P.; Gleiter, R.; Taylor, R.T.; Browne, A.R.; Paquette, L.A., Electronic structure of tricyclo[4.1.0.02,7]hept-3-enes. Correlation with the regioselectivity of electrophilic attack, J. Org. Chem., 1978, 43, 2391. [all data]