Propanoic acid, 2-methyl-, 1-methylethyl ester

Kovats' RI, non-polar column, isothermal

View large format table.

Column type Active phase Temperature (C) I Reference Comment
CapillaryOV-10180.783.Komárek, Hornová, et al., 1983Column length: 15. m; Column diameter: 0.22 mm
PackedSE-30150.780.Ashes and Haken, 1974Celaton (62-72 mesh); Column length: 3.7 m
PackedSE-30100.784.Chastrette, Heintz, et al., 1974N2, Chromosorb W AW (60-80 mesh); Column length: 3. m
PackedOV-1150.785.Ashes and Haken, 1971
PackedSE-30150.785.Germaine and Haken, 1969Celite 560; Column length: 3.7 m

Kovats' RI, non-polar column, custom temperature program

View large format table.

Column type Active phase I Reference Comment
CapillarySE-30780.Chretien and Dubois, 1978Program: not specified

Kovats' RI, polar column, isothermal

View large format table.

Column type Active phase Temperature (C) I Reference Comment
PackedCarbowax 20M100.959.Chastrette, Heintz, et al., 1974Chromosorb WAW (60-80 mesh); Column length: 3. m

Normal alkane RI, non-polar column, custom temperature program

View large format table.

Column type Active phase I Reference Comment
CapillarySE-30780.Liu, Liang, et al., 2007Program: not specified

Phase change data

Data compiled as indicated in comments:
BS - Robert L. Brown and Stephen E. Stein
AC - William E. Acree, Jr., James S. Chickos

Quantity Value Units Method Reference Comment
Tboil393.9KN/AWeast and Grasselli, 1989BS

Enthalpy of vaporization

ΔvapH (kJ/mol) Temperature (K) Method Reference Comment
43.3272.AStephenson and Malanowski, 1987Based on data from 257. - 394. K. See also Stull, 1947.; AC

Antoine Equation Parameters

log10(P) = A − (B / (T + C))
    P = vapor pressure (bar)
    T = temperature (K)

View plot Requires a JavaScript / HTML 5 canvas capable browser.

Temperature (K) A B C Reference Comment
256.9 - 393.74.345861488.585-50.731Stull, 1947Coefficents calculated by NIST from author's data.

References

Komárek, Hornová, et al., 1983
Komárek, K.; Hornová, L.; Horna, A.; Churácek, J., Glass capillary gas chromatography of homologous series of esters. IV. Separation of homologous series of certain halogenopropyl esters of aliphatic carboxylic acids on OV-101, J. Chromatogr., 1983, 281, 299-303, https://doi.org/10.1016/S0021-9673(01)87889-4 . [all data]

Ashes and Haken, 1974
Ashes, J.R.; Haken, J.K., Gas chromatography of homologous esters. VI. Structure-retention increments of aliphatic esters, J. Chromatogr., 1974, 101, 1, 103-123, https://doi.org/10.1016/S0021-9673(01)94737-5 . [all data]

Chastrette, Heintz, et al., 1974
Chastrette, M.; Heintz, M.; Druilhe, A.; Lefort, D., Analyse chromatographique d'esters aliphatiques saturés. Relations rétention-structure et prévision de la rétention, Bull. Soc. Chim. Fr., 1974, 9/10,Pt.1, 1852-1856. [all data]

Ashes and Haken, 1971
Ashes, J.R.; Haken, J.K., Gas chromatography of homologous esters. Part V. Retention of aliphatic esters on non-polar, donar and acceptor stationary phases, J. Chromatogr., 1971, 60, 33-44, https://doi.org/10.1016/S0021-9673(00)95527-4 . [all data]

Germaine and Haken, 1969
Germaine, R.W.; Haken, J.K., Gas chromatography of homologous esters. Part 1. Simple aliphatic esters, J. Chromatogr., 1969, 43, 33-42, https://doi.org/10.1016/S0021-9673(00)99162-3 . [all data]

Chretien and Dubois, 1978
Chretien, J.R.; Dubois, J-E., Topological Analysis: A Technique for the Physico-Chemical Exploitation of Retention Data in Gas-Liquid Chromatography, J. Chromatogr., 1978, 158, 43-56, https://doi.org/10.1016/S0021-9673(00)89954-9 . [all data]

Liu, Liang, et al., 2007
Liu, F.; Liang, Y.; Cao, C.; Zhou, N., QSPR study of GC retention indices for saturated esters on seven stationary phases based on novel topological indices, Talanta, 2007, 72, 4, 1307-1315, https://doi.org/10.1016/j.talanta.2007.01.038 . [all data]