Trimecaine

Kovats' RI, non-polar column, isothermal

View large format table.

Column type Active phase Temperature (C) I Reference Comment
PackedOV-101180.1968.Delbeke, Debackere, et al., 1981
PackedOV-101190.1974.Delbeke, Debackere, et al., 1981

Normal alkane RI, non-polar column, custom temperature program

View large format table.

Column type Active phase I Reference Comment
CapillaryHP-11971.Grigor'ev, Bozhko, et al., 2009Helium; Program: not specified
OtherMethyl Silicone1971.Ardrey and Moffat, 1981Program: not specified

References

Delbeke, Debackere, et al., 1981
Delbeke, F.T.; Debackere, M.; Desmet, N., Detection of some local anaesthetics in horse urine and plasma by gas-liquid chromatography, J. Chromatogr., 1981, 206, 3, 594-599, https://doi.org/10.1016/S0021-9673(00)88931-1 . [all data]

Grigor'ev, Bozhko, et al., 2009
Grigor'ev, A.M.; Bozhko, E.S.; Rudakova, L.V., Use of correlation between retention indices on low-polarity phases for screening comp-lex mixtures by gas chromatography-mass spectrometry, Rus. J. Anal. Chem., 2009, 64, 2, 140-143, https://doi.org/10.1134/S1061934809020087 . [all data]

Ardrey and Moffat, 1981
Ardrey, R.E.; Moffat, A.C., Gas-liquid chromatographic retention indices of 1318 substances of toxicological interest on SE-30 or OV-1 stationary phase, J. Chromatogr., 1981, 220, 3, 195-252, https://doi.org/10.1016/S0021-9673(00)81925-1 . [all data]