1,3,5,7-Octatetrayne

Gas phase ion energetics data

Data compiled as indicated in comments:
B - John E. Bartmess
LLK - Sharon G. Lias, Rhoda D. Levin, and Sherif A. Kafafi

Ionization energy determinations

IE (eV) Method Reference Comment
9.09 ± 0.02PEAllan, Heilbronner, et al., 1976LLK

De-protonation reactions

C8H- + Hydrogen cation = 1,3,5,7-Octatetrayne

By formula: C8H- + H+ = C8H2

Quantity Value Units Method Reference Comment
Δr1485. ± 21.kJ/molD-EAGarand, Yacovitch, et al., 2010gas phase; Calns says linear H-terminated structure for anion; B
Quantity Value Units Method Reference Comment
Δr1451. ± 21.kJ/molH-TSGarand, Yacovitch, et al., 2010gas phase; Calns says linear H-terminated structure for anion; B

Gas phase thermochemistry data

Data compiled by: Glushko Thermocenter, Russian Academy of Sciences, Moscow

Constant pressure heat capacity of gas

Cp,gas (cal/mol*K) Temperature (K) Reference Comment
11.0850.Dorofeeva O.V., 1991There is an appreciable difference with other statistically calculated values [ Dessau L., 1988] because the authors used the overestimated values of vibrational frequencies, see [ Dorofeeva O.V., 1991].
15.55100.
20.60150.
25.342200.
30.691273.15
32.1 ± 1.7298.15
32.211300.
36.453400.
39.369500.
41.613600.
43.463700.
45.033800.
46.379900.
47.5411000.
48.5441100.
49.4121200.
50.1631300.
50.8151400.
51.3841500.
51.8791600.
52.3111700.
52.6941800.
53.0281900.
53.3252000.

Reaction thermochemistry data

Data compiled by: John E. Bartmess

Individual Reactions

C8H- + Hydrogen cation = 1,3,5,7-Octatetrayne

By formula: C8H- + H+ = C8H2

Quantity Value Units Method Reference Comment
Δr355.0 ± 5.0kcal/molD-EAGarand, Yacovitch, et al., 2010gas phase; Calns says linear H-terminated structure for anion
Quantity Value Units Method Reference Comment
Δr346.9 ± 5.1kcal/molH-TSGarand, Yacovitch, et al., 2010gas phase; Calns says linear H-terminated structure for anion

References

Allan, Heilbronner, et al., 1976
Allan, M.; Heilbronner, E.; Kloster-Jensen, E.; Maier, J.P., The {PI}-states of tetraacetylene radical cation, Chem. Phys. Lett., 1976, 41, 228. [all data]

Garand, Yacovitch, et al., 2010
Garand, E.; Yacovitch, T.I.; Zhou, J.; Sheehan, S.M.; Neumark, D.M., Slow photoelectron velocity-map imaging of the CnH- (n=5-9) anions, Chem. Sci., 2010, 1, 2, 192-201, https://doi.org/10.1039/c0sc00164c . [all data]