Cyclohexane, 1,1'-(1,4-butanediyl)bis-

Condensed phase thermochemistry data

Data compiled by: Hussein Y. Afeefy, Joel F. Liebman, and Stephen E. Stein

Quantity Value Units Method Reference Comment
Δcliquid-10220.kJ/molCcbSerijan and Wise, 1952Corresponding Δfliquid = -360. kJ/mol (simple calculation by NIST; no Washburn corrections)
Δcliquid-10223.kJ/molCcbWise, Serijan, et al., 1951Corresponding Δfliquid = -360. kJ/mol (simple calculation by NIST; no Washburn corrections)

Phase change data

Data compiled by: Thermodynamics Research Center, NIST Boulder Laboratories, Chris Muzny director

Quantity Value Units Method Reference Comment
Tboil582.2KN/ASerijan and Wise, 1952, 2Uncertainty assigned by TRC = 0.6 K
Tboil578.KN/ASabatier and Murat, 1913Uncertainty assigned by TRC = 4. K
Quantity Value Units Method Reference Comment
Tfus284.77KN/ASerijan and Wise, 1952, 2Uncertainty assigned by TRC = 0.1 K
Tfus285.KN/AKuhn and Winterstein, 1928Uncertainty assigned by TRC = 3. K
Tfus282.KN/ASabatier and Murat, 1913Uncertainty assigned by TRC = 3. K

In addition to the Thermodynamics Research Center (TRC) data available from this site, much more physical and chemical property data is available from the following TRC products:

References

Serijan and Wise, 1952
Serijan, K.T.; Wise, P.H., Dicyclic hydrocarbons. V. Synthesis and physical properties of the diphenyl- and dicyclohexylbutanes, J. Am. Chem. Soc., 1952, 74, 365-368. [all data]

Wise, Serijan, et al., 1951
Wise, C.H.; Serijan, K.T.; Goodman, I.A., NACA Technical Report 1003, NACA Technical Report 1003, 1951, 1-10. [all data]

Serijan and Wise, 1952, 2
Serijan, K.T.; Wise, P.H., Dicyclic hydrocarbons. V. Synthesis and physical properties of the diphenyl - and dicyclohexylbutanes, J. Am. Chem. Soc., 1952, 74, 365-8. [all data]

Sabatier and Murat, 1913
Sabatier, P.; Murat, M., C. R. Hebd. Seances Acad. Sci., 1913, 156, 1430. [all data]

Kuhn and Winterstein, 1928
Kuhn, R.; Winterstein, A., Helv. Chim. Acta, 1928, 11, 123. [all data]