pyrene, compd. with 2,4,6-trinitrophenol(1:1)

Phase change data

Data compiled by: Thermodynamics Research Center, NIST Boulder Laboratories, Chris Muzny director

Quantity Value Units Method Reference Comment
Tfus503.KN/AKotula and Rabczuk, 1988Uncertainty assigned by TRC = 1. K

In addition to the Thermodynamics Research Center (TRC) data available from this site, much more physical and chemical property data is available from the following TRC products:

References

Kotula and Rabczuk, 1988
Kotula, I.; Rabczuk, A., Thermal investigation of organic crystalline complexes. I. enthalpies and entropies of fusion, Thermochim. Acta, 1988, 126, 61. [all data]