DL-Norleucine

Condensed phase thermochemistry data

Data compiled by: Hussein Y. Afeefy, Joel F. Liebman, and Stephen E. Stein

Quantity Value Units Method Reference Comment
Δcsolid-3579.8 ± 1.3kJ/molCcbStrepikheev, Skuratov, et al., 1955Reanalyzed by Cox and Pilcher, 1970, Original value = -3581. kJ/mol; At 293 °K

Phase change data

Data compiled as indicated in comments:
ALS - Hussein Y. Afeefy, Joel F. Liebman, and Stephen E. Stein
AC - William E. Acree, Jr., James S. Chickos
DH - Eugene S. Domalski and Elizabeth D. Hearing

Enthalpy of sublimation

ΔsubH (kJ/mol) Temperature (K) Method Reference Comment
115. ± 0.4455.VSvec and Clyde, 1965ALS
114.5 ± 0.4450.MESvec and Clyde, 1965, 2Based on data from 435. - 469. K. See also Clyde and Svec, 1964 and Stephenson and Malanowski, 1987.; AC

Enthalpy of phase transition

ΔHtrs (kJ/mol) Temperature (K) Initial Phase Final Phase Reference Comment
4.200390.4crystaline, IIcrystaline, IPetropavlov, Tsygankova, et al., 1988DH
4.410390.crystaline, IIcrystaline, IGrunenberg, Bougeard, et al., 1984DH

Entropy of phase transition

ΔStrs (J/mol*K) Temperature (K) Initial Phase Final Phase Reference Comment
10.7390.4crystaline, IIcrystaline, IPetropavlov, Tsygankova, et al., 1988DH
11.31390.crystaline, IIcrystaline, IGrunenberg, Bougeard, et al., 1984DH

References

Strepikheev, Skuratov, et al., 1955
Strepikheev, A.A.; Skuratov, S.M.; Shtekher, S.M.; Muromova, R.S.; Brykina, E.P.; Kachinskaya, O.N., Mutual interaction of amino and carboxyl groups in amino acids, Dokl. Akad. Nauk SSSR, 1955, 102, 543-545. [all data]

Cox and Pilcher, 1970
Cox, J.D.; Pilcher, G., Thermochemistry of Organic and Organometallic Compounds, Academic Press, New York, 1970, 1-636. [all data]

Svec and Clyde, 1965
Svec, H.J.; Clyde, D.D., Vapor pressures of some α-amino acids, J. Chem. Eng. Data, 1965, 10, 151. [all data]

Svec and Clyde, 1965, 2
Svec, H.J.; Clyde, D.D., Vapor Pressures of Some α-Amino Acids., J. Chem. Eng. Data, 1965, 10, 2, 151-152, https://doi.org/10.1021/je60025a024 . [all data]

Clyde and Svec, 1964
Clyde, D.D.; Svec, H., , U. S. Atomic Energy Comm. IS-790, 1964, 1. [all data]

Stephenson and Malanowski, 1987
Stephenson, Richard M.; Malanowski, Stanislaw, Handbook of the Thermodynamics of Organic Compounds, 1987, https://doi.org/10.1007/978-94-009-3173-2 . [all data]

Petropavlov, Tsygankova, et al., 1988
Petropavlov, N.N.; Tsygankova, I.G.; Teslenko, L.A., Microcalorimetric investigation of polymorphic transitions in organic crystals, Sov. Phys. Crystallogr., 1988, 33(6), 853-855. [all data]

Grunenberg, Bougeard, et al., 1984
Grunenberg, A.; Bougeard, D.; Schrader, B., DSC-investigations of 22 crystalline neutral aliphatic amino acids in the temperature range 233 to 423 K, Thermochim. Acta, 1984, 77, 59-66. [all data]