1,4-Benzenediol, 2,5-dimethyl-

Phase change data

Data compiled as indicated in comments:
AC - William E. Acree, Jr., James S. Chickos
ALS - Hussein Y. Afeefy, Joel F. Liebman, and Stephen E. Stein

Quantity Value Units Method Reference Comment
Δsub24.10kcal/molVCoolidge and Coolidge, 1927ALS

Enthalpy of vaporization

ΔvapH (kcal/mol) Temperature (K) Method Reference Comment
24.16346.AStephenson and Malanowski, 1987Based on data from 331. - 361. K.; AC

Enthalpy of sublimation

ΔsubH (kcal/mol) Temperature (K) Method Reference Comment
24.09332. - 361.QFCoolidge and Coolidge, 1927See also Jones, 1960.; AC

References

Coolidge and Coolidge, 1927
Coolidge, A.S.; Coolidge, M.S., The sublimation pressures of substituted quinones and hydroquinones, J. Am. Chem. Soc., 1927, 49, 100-104. [all data]

Stephenson and Malanowski, 1987
Stephenson, Richard M.; Malanowski, Stanislaw, Handbook of the Thermodynamics of Organic Compounds, 1987, https://doi.org/10.1007/978-94-009-3173-2 . [all data]

Jones, 1960
Jones, A.H., Sublimation Pressure Data for Organic Compounds., J. Chem. Eng. Data, 1960, 5, 2, 196-200, https://doi.org/10.1021/je60006a019 . [all data]