trans-2-Ethyl-3-methylthiophane

Kovats' RI, non-polar column, isothermal

View large format table.

Column type Active phase Temperature (C) I Reference Comment
CapillaryOV-101100.986.Gal'pern, Gollandskikh, et al., 1976H2; Column length: 100. m; Column diameter: 0.25 mm

Normal alkane RI, non-polar column, temperature ramp

View large format table.

Column type Active phase I Reference Comment
CapillaryOV-101986.Limin, Jichun, et al., 198875. C @ 8. min, 2. K/min; Column length: 25. m; Column diameter: 0.25 mm; Tend: 130. C

References

Gal'pern, Gollandskikh, et al., 1976
Gal'pern, G.D.; Gollandskikh, N.I.; Gordadze, G.N., Application of methylene-insertion reactions to cyclic sulphides (C4H8S, C5H10S and C6H12S) to produce standard compounds for gas chromatography, J. Chromatogr., 1976, 124, 1, 43-51, https://doi.org/10.1016/S0021-9673(00)87835-8 . [all data]

Limin, Jichun, et al., 1988
Limin, Z.; Jichun, J.; Shiyi, L.; Keman, S., Identification of sulfur ethers in Jianghan naphtha fractions, Acta Petrolei Sinica, 1988, 4, 1, 100-107. [all data]