1,4-Benzenediol, 2-chloro-

Condensed phase thermochemistry data

Data compiled by: Hussein Y. Afeefy, Joel F. Liebman, and Stephen E. Stein

Quantity Value Units Method Reference Comment
Δfsolid-393.kJ/molCcbSjostrom, 1936At 318 K
Quantity Value Units Method Reference Comment
Δcsolid-2716.3 ± 8.4kJ/molCcbSmith, Bjellerup, et al., 1953Reanalyzed by Cox and Pilcher, 1970, Original value = -2631.6 ± 4.6 kJ/mol
Δcsolid-2714.kJ/molCcbSjostrom, 1936At 318 K
Δcsolid-2702.kJ/molCcbSwietoslawski and Starczedska, 1925

References

Sjostrom, 1936
Sjostrom, Av.G., De klorsubstituerade kinonernas och hydrokinonernas termokemi, Svensk. Kim. Tidr., 1936, 48, 121-124. [all data]

Smith, Bjellerup, et al., 1953
Smith, L.; Bjellerup, L.; Krook, S.; Westermark, H., Heats of combustion of organic chloro compounds determined by the "quartz wool" method, Acta Chem. Scand., 1953, 7, 65. [all data]

Cox and Pilcher, 1970
Cox, J.D.; Pilcher, G., Thermochemistry of Organic and Organometallic Compounds, Academic Press, New York, 1970, 1-636. [all data]

Swietoslawski and Starczedska, 1925
Swietoslawski, W.; Starczedska, H., Correction des donnees thermochimiques de M.A. Valeur, J. Chem. Phys., 1925, 22, 399-401. [all data]