Benzenamine, 2-iodo-

Phase change data

Data compiled by: William E. Acree, Jr., James S. Chickos

Quantity Value Units Method Reference Comment
Δsub81.3 ± 1.4kJ/molCRibeiro da Silva, Ferreira, et al., 2006

Enthalpy of fusion

ΔfusH (kJ/mol) Temperature (K) Reference
19.38329.6Ribeiro da Silva, Ferreira, et al., 2006
13.95333.Khanna, Khetarpal, et al., 1983

Gas phase ion energetics data

Data compiled by: Sharon G. Lias, Rhoda D. Levin, and Sherif A. Kafafi

Ionization energy determinations

IE (eV) Method Reference
8.35EIBaldwin, Loudon, et al., 1976

Appearance energy determinations

Ion AE (eV) Other Products MethodReferenceComment
C6H6N+11.60IEIBaldwin, Loudon, et al., 1976

References

Ribeiro da Silva, Ferreira, et al., 2006
Ribeiro da Silva, Manuel A.V.; Ferreira, Ana I.M.C.L.; Gomes, José R.B., Experimental and computational study on the thermochemistry of the isomers of iodoaniline and diiodoaniline, Chemical Physics Letters, 2006, 422, 4-6, 565-570, https://doi.org/10.1016/j.cplett.2006.03.004 . [all data]

Khanna, Khetarpal, et al., 1983
Khanna, M.S.; Khetarpal, S.C.; Lal, K.; Bhatnagar, H.L., Thermodynamic studies on melting of some o-, m-, and p-halogen derivatives of aniline, Indian J. Pure Appl. Phys., 1983, 20, 6, 503. [all data]

Baldwin, Loudon, et al., 1976
Baldwin, M.A.; Loudon, A.G.; Maccoll, A.; Webb, K.S., The nature and fragmentation pathways of the molecular ions of some arylureas, arylthioureas, acetanilides, thioacetanilides and related compounds, Org. Mass Spectrom., 1976, 11, 1181. [all data]