3-Hexanol, 4-methyl-

Van Den Dool and Kratz RI, non-polar column, temperature ramp

View large format table.

Column type Active phase I Reference Comment
CapillarySPB-1721.Huang, Bruechert, et al., 198760. m/0.25 mm/0.25 μm, He, 35. C @ 10. min, 2. K/min, 235. C @ 40. min
CapillarySPB-1721.Huang, Bruechert, et al., 198760. m/0.25 mm/0.25 μm, He, 35. C @ 10. min, 2. K/min, 235. C @ 40. min

Normal alkane RI, polar column, custom temperature program

View large format table.

Column type Active phase I Reference Comment
CapillaryDB-Wax1583.Welke, Manfroi, et al., 201230. m/0.25 mm/0.25 μm, Helium; Program: not specified

References

Huang, Bruechert, et al., 1987
Huang, T.-C.; Bruechert, L.J.; Hartman, T.G.; Rosen, R.T.; Ho, C.-T., Effect of lipids and carbohydrates on thermal generation of volatiles from commercial zein, J. Agric. Food Chem., 1987, 35, 6, 985-990, https://doi.org/10.1021/jf00078a030 . [all data]

Welke, Manfroi, et al., 2012
Welke, J.E.; Manfroi, V.; Zanus, M.; Lazarotto, M.; Zini, C.A., Characterization of the volatile profile of Brazilian merlot wines through comprehensive two dimensional gas chromatography time-of-flight mass spectrometric detection, J. Chromatogr. A, 2012, 1226, 124-139, https://doi.org/10.1016/j.chroma.2012.01.002 . [all data]