2H-Benzimidazol-2-one, 1,3-dihydro-

Condensed phase thermochemistry data

Data compiled by: Hussein Y. Afeefy, Joel F. Liebman, and Stephen E. Stein

Quantity Value Units Method Reference Comment
Δfsolid-20.33 ± 0.76kcal/molCcbContineanu, Wagner, et al., 1982
Quantity Value Units Method Reference Comment
Δcsolid-843.10 ± 0.76kcal/molCcbContineanu, Wagner, et al., 1982

Phase change data

Data compiled by: William E. Acree, Jr., James S. Chickos

Quantity Value Units Method Reference Comment
Δsub30.21 ± 0.57kcal/molCMorais, Miranda, et al., 2006

References

Contineanu, Wagner, et al., 1982
Contineanu, I.; Wagner, L.; Stanescu, L.; Marchidan, D.I., Combustion and formation enthalpies of o-phenylenediamine, urea and 2-benzimidazolone, Rev. Roum. Chim., 1982, 27, 205-209. [all data]

Morais, Miranda, et al., 2006
Morais, V.M.F.; Miranda, M.S.; Matos, M.A.R.; Liebman, J.F., Experimental and computational thermochemistry of three nitrogen-containing heterocycles: 2-benzimidazolinone, 2-benzoxazolinone and 3-indazolinone, Molecular Physics, 2006, 104, 3, 325-334, https://doi.org/10.1080/00268970500290300 . [all data]