Benzeneacetic acid, 2-hydroxy-

Phase change data

Data compiled by: Thermodynamics Research Center, NIST Boulder Laboratories, Chris Muzny director

Quantity Value Units Method Reference Comment
Tfus422.KN/ABarnes and McElvain, 1937Uncertainty assigned by TRC = 3. K
Tfus420.KN/ABarnes and McElvain, 1937Uncertainty assigned by TRC = 2. K

In addition to the Thermodynamics Research Center (TRC) data available from this site, much more physical and chemical property data is available from the following TRC products:

Gas phase ion energetics data

Data compiled by: Sharon G. Lias, Rhoda D. Levin, and Sherif A. Kafafi

Ionization energy determinations

IE (eV) Method Reference
8.16 ± 0.02EIBenezra and Bursey, 1972

Appearance energy determinations

Ion AE (eV) Other Products MethodReferenceComment
C6H5O2+12.54 ± 0.02CH3COEIBenezra and Bursey, 1972
C6H6O2+9.30 ± 0.02CH2=C=OEIBenezra and Bursey, 1972

References

Barnes and McElvain, 1937
Barnes, H.M.; McElvain, S.M., Further Observations on the Condensation of Benzene with Alloxan, J. Am. Chem. Soc., 1937, 59, 2348-51. [all data]

Benezra and Bursey, 1972
Benezra, S.A.; Bursey, M.M., Hydrogen bonding in mass spectral activated complexes. A correction, J. Chem. Soc. Perkin Trans. 2, 1972, 11, 1537. [all data]