Propionic acid, 2-methyl-2-nitroso-, methyl ester, dimer

Gas phase ion energetics data

Data compiled by: Sharon G. Lias, Rhoda D. Levin, and Sherif A. Kafafi

Appearance energy determinations

Ion AE (eV) Other Products MethodReferenceComment
CH3+14.20?EIDay, Gowenlock, et al., 1978
C2H3O2+11.05?EIDay, Gowenlock, et al., 1978
NO+9.90?EIDay, Gowenlock, et al., 1978

References

Day, Gowenlock, et al., 1978
Day, J.S.; Gowenlock, B.G.; Johnson, C.A.F.; McInally, I.D.; Pfab, J., Appearance potential studies of some geminal substituted C-nitroso- compounds, J. Chem. Soc. Perkin Trans. 2, 1978, 10, 1110. [all data]