m-tolyl benzoate

Gas phase ion energetics data

Data compiled by: Sharon G. Lias and Joel F. Liebman

Ionization energy determinations

IE (eV) Method Reference
8.47PIOrlov, Ponomarev, et al., 1991

Appearance energy determinations

Ion AE (eV) Other Products MethodReferenceComment
C7H5O+9.42C7H7OPIOrlov, Ponomarev, et al., 1991

References

Orlov, Ponomarev, et al., 1991
Orlov, V.M.; Ponomarev, D.A.; Misharev, A.D.; Takhistov, V.V., Photoionization mass spectrometry and the relative stabilities of aryloxy radicals, J. Gen. Chem. USSR, 1991, 61, 2088. [all data]