Iron, tricarbonyl[nonahydropentaborate]-

Gas phase ion energetics data

Data compiled by: Sharon G. Lias, Rhoda D. Levin, and Sherif A. Kafafi

Ionization energy determinations

IE (eV) Method Reference Comment
8.4PEUlman, Andersen, et al., 1978Vertical value

References

Ulman, Andersen, et al., 1978
Ulman, J.A.; Andersen, E.L.; Fehlner, T.P., Characterization of ferraboranes by ultraviolet photoelectron spectroscopy, J. Am. Chem. Soc., 1978, 100, 456. [all data]