Ethanone, 1-phenyl-, oxime

Condensed phase thermochemistry data

Data compiled by: Hussein Y. Afeefy, Joel F. Liebman, and Stephen E. Stein

Quantity Value Units Method Reference Comment
Δfsolid-9.8kcal/molCcbLandrieu, 1905
Quantity Value Units Method Reference Comment
Δcsolid-1055.kcal/molCcbLandrieu, 1905

Normal alkane RI, non-polar column, custom temperature program

View large format table.

Column type Active phase I Reference Comment
CapillaryPolydimethyl siloxanes1310.Zenkevich and Chupalov, 1996Program: not specified

References

Landrieu, 1905
Landrieu, Ph., Thermochimie. - Chaleur de formation des oximes, C.R. Acad. Sc. Paris, 1905, 140, 867-870. [all data]

Lang (editor), 1961
Lang (editor), L., Absorption Spectra in the Ultraviolet and Visible Region, 1961, 2, 111. [all data]

Zenkevich and Chupalov, 1996
Zenkevich, I.G.; Chupalov, A.A., New Possibilities of Chromato Mass Pectrometric Identification of Organic Compounds Using Increments of Gas Chromatographic Retention Indices of Molecular Structural Fragments, Zh. Org. Khim. (Rus.), 1996, 32, 5, 656-666. [all data]