Naphthalene, 2-(phenylmethoxy)-

Gas phase ion energetics data

Data compiled by: Sharon G. Lias, Rhoda D. Levin, and Sherif A. Kafafi

Ionization energy determinations

IE (eV) Method Reference
7.82CTSWeschke, Timpe, et al., 1979

References

Weschke, Timpe, et al., 1979
Weschke, W.; Timpe, H.-J.; Just, G., Untersuchungen an EDA-Komplexen von Benzylarylethern, J. Prakt. Chem., 1979, 321, 605. [all data]