Tetraantimony pentasulfide

Gas phase ion energetics data

Data compiled by: Henry M. Rosenstock, Keith Draxl, Bruce W. Steiner, and John T. Herron

Ionization energy determinations

IE (eV) Method Reference
8.5 ± 0.3EISullivan, Prusaczyk, et al., 1970

References

Sullivan, Prusaczyk, et al., 1970
Sullivan, C.L.; Prusaczyk, J.E.; Carlson, K.D., Molecules in the equilibrium vaporization of antimony sulfide and selenide, J. Chem. Phys., 1970, 53, 1289. [all data]