Trigermanium monosilicide

Gas phase ion energetics data

Data compiled by: Henry M. Rosenstock, Keith Draxl, Bruce W. Steiner, and John T. Herron

Ionization energy determinations

IE (eV) Method Reference
8.6 ± 0.3EIDrowart, DeMaria, et al., 1959

References

Drowart, DeMaria, et al., 1959
Drowart, J.; DeMaria, G.; Boerboom, A.J.H.; Inghram, M.G., Mass spectrometric study of intergroup IVB molecules, J. Chem. Phys., 1959, 30, 308. [all data]