Piperazine, n,n'-diphenyl-

Phase change data

Data compiled by: Thermodynamics Research Center, NIST Boulder Laboratories, Chris Muzny director

Quantity Value Units Method Reference Comment
Tfus437.15KN/AAroney and Le Fevre, 1960Uncertainty assigned by TRC = 2. K

In addition to the Thermodynamics Research Center (TRC) data available from this site, much more physical and chemical property data is available from the following TRC products:

References

Aroney and Le Fevre, 1960
Aroney, M.; Le Fevre, R.J.W., Molecular polarizability. The conformation of various n-substituted anilines, piperidines, and piperazines, J. Chem. Soc., 1960, 1960, 2161. [all data]