2-Hydroxy-4,4'-dimethoxybenzophenone

Phase change data

Data compiled by: William E. Acree, Jr., James S. Chickos

Enthalpy of fusion

ΔfusH (kcal/mol) Temperature (K) Method Reference
8.99390.4DSCPrice and Hawkins, 1999

References

Price and Hawkins, 1999
Price, Duncan M.; Hawkins, Michael, Vapour pressures of hydroxybenzophenone UV absorbers, Thermochimica Acta, 1999, 329, 1, 73-76, https://doi.org/10.1016/S0040-6031(99)00005-2 . [all data]