1,3-Dioxane, 2,4-dimethyl-6-phenyl-, (2α,4α,6β)-

Reaction thermochemistry data

Data compiled by: Hussein Y. Afeefy, Joel F. Liebman, and Stephen E. Stein

Individual Reactions

C12H16O2 = C12H16O2

By formula: C12H16O2 = C12H16O2

Quantity Value Units Method Reference Comment
Δr-2.0 ± 0.2kcal/molCisoBailey, Connon, et al., 1978liquid phase; solvent: 1,4--Dioxane; Boron trifluoride catalyst

References

Bailey, Connon, et al., 1978
Bailey, W.F.; Connon, H.; Eliel, E.L.; Wiberg, K.B., Calorimetric determination of the conformational enthalpy and entropy of 2-phenyl-1,3-dioxane. Effectively free rotation of an equatorial 2-phenyl group. Conformational equilibria in 2,2-disubstituted 1,3-dioxanes, J. Am. Chem. Soc., 1978, 100, 2202-2209. [all data]