Naphthalene, 2-phenyl-

Phase change data

Data compiled as indicated in comments:
BS - Robert L. Brown and Stephen E. Stein
TRC - Thermodynamics Research Center, NIST Boulder Laboratories, Chris Muzny director
AC - William E. Acree, Jr., James S. Chickos

Quantity Value Units Method Reference Comment
Tboil618.7KN/AWeast and Grasselli, 1989BS
Quantity Value Units Method Reference Comment
Tfus375.2KN/ABinns and Squire, 1962Uncertainty assigned by TRC = 1.5 K; TRC
Tfus375.KN/AKlemm, Reed, et al., 1957Uncertainty assigned by TRC = 3. K; TRC
Tfus374.4KN/AKochetkov, Nifant'ev, et al., 1957Uncertainty assigned by TRC = 2. K; TRC
Tfus374.9KN/AKutz, Nickels, et al., 1948Uncertainty assigned by TRC = 1. K; TRC
Quantity Value Units Method Reference Comment
Δsub107.6 ± 0.6kJ/molMERocha, Lima, et al., 2008Based on data from 333. - 353. K.; AC

Reduced pressure boiling point

Tboil (K) Pressure (bar) Reference Comment
460.70.007Weast and Grasselli, 1989BS

Enthalpy of sublimation

ΔsubH (kJ/mol) Temperature (K) Method Reference Comment
106.6 ± 0.4343.MERocha, Lima, et al., 2008Based on data from 333. - 353. K.; AC

Enthalpy of fusion

ΔfusH (kJ/mol) Temperature (K) Method Reference Comment
17.9373.5DSCRocha, Lima, et al., 2008AC

In addition to the Thermodynamics Research Center (TRC) data available from this site, much more physical and chemical property data is available from the following TRC products:

Gas phase ion energetics data

Data compiled by: Sharon G. Lias, Rhoda D. Levin, and Sherif A. Kafafi

Ionization energy determinations

IE (eV) Method Reference
7.75PESchafer, Schweig, et al., 1973

Van Den Dool and Kratz RI, non-polar column, temperature ramp

View large format table.

Column type Active phase I Reference Comment
CapillaryOV-11949.9Zhang, Shen, et al., 200025. m/0.2 mm/0.33 μm, 5. K/min; Tstart: 100. C; Tend: 180. C
CapillaryOV-11958.5Zhang, Shen, et al., 200025. m/0.2 mm/0.33 μm, 5. K/min; Tstart: 100. C; Tend: 180. C
CapillaryDB-51987.Rostad and Pereira, 198630. m/0.26 mm/0.25 μm, He, 50. C @ 4. min, 6. K/min, 300. C @ 20. min

Van Den Dool and Kratz RI, non-polar column, custom temperature program

View large format table.

Column type Active phase I Reference Comment
CapillaryMethyl Silicone1930.Oda, Ichikawa, et al., 1996Program: 50C (2min) => 20C/min => 160C => 5C/min => 210C => 10C/min => 300C

Normal alkane RI, non-polar column, temperature ramp

View large format table.

Column type Active phase I Reference Comment
CapillaryUltra-11940.Elizalde-González, Hutfliess, et al., 199650. m/0.2 mm/0.33 μm, H2, 3. K/min, 300. C @ 35. min; Tstart: 60. C

Lee's RI, non-polar column, temperature ramp

View large format table.

Column type Active phase I Reference Comment
CapillaryHP-5343.5Wang, Hou, et al., 200730. m/0.30 mm/0.25 μm, Helium, 50. C @ 5. min, 5. K/min, 200. C @ 15. min
CapillaryHP-5330.45Marynowski, Pieta, et al., 200460. m/0.25 mm/0.25 μm, He, 3. K/min; Tstart: 35. C; Tend: 300. C
CapillaryDB-5MS330.85Chen, Keeran, et al., 200230. m/0.25 mm/0.5 μm, 40. C @ 1. min, 10. K/min; Tend: 310. C
CapillaryDB-5MS330.76Chen, Keeran, et al., 200230. m/0.25 mm/0.5 μm, 40. C @ 1. min, 4. K/min; Tend: 310. C
CapillaryPTE-5330.64Wang, Jia, et al., 200030. m/0.25 mm/0.25 μm, 60. C @ 1.5 min, 8. K/min, 300. C @ 12.5 min
CapillaryHP-5331.25Piao, Chu, et al., 199930. m/0.25 mm/0.25 μm, 50. C @ 2. min, 4. K/min, 280. C @ 20. min
CapillaryDB-5333.9Durlak, Biswas, et al., 199830. m/0.25 mm/0.25 μm, 15. K/min; Tstart: 50. C; Tend: 300. C
CapillaryDB-5333.9Durlak, Biswas, et al., 199830. m/0.25 mm/0.25 μm, 15. K/min; Tstart: 50. C; Tend: 300. C
CapillarySE-54330.83Chen, 19964. K/min; Column length: 30. m; Column diameter: 0.25 mm; Tstart: 50. C; Tend: 300. C
CapillarySPB-5331.0Knobloch and Engewald, 199340. C @ 2. min, 4. K/min; Column length: 30. m; Column diameter: 0.25 mm; Tend: 300. C
CapillaryCP Sil 8 CB331.2Bundt, Herbel, et al., 199150. m/0.25 mm/0.25 μm, He, 4. K/min; Tstart: 80. C; Tend: 300. C
CapillarySE-54331.07Guillén, Blanco, et al., 198920. m/0.22 mm/0.20 μm, He, 4. K/min; Tstart: 50. C; Tend: 300. C
CapillaryDB-5330.29Sye, Lin, et al., 198830. m/0.32 mm/0.25 μm, 80. C @ 1. min, 3. K/min; Tend: 290. C
CapillaryDB-5330.73Rostad and Pereira, 198630. m/0.26 mm/0.25 μm, He, 50. C @ 4. min, 6. K/min, 300. C @ 20. min
CapillarySE-52332.64Vassilaros, Kong, et al., 198220. m/0.30 mm/0.25 μm, H2, 40. C @ 2. min, 4. K/min; Tend: 265. C
CapillarySE-52332.59Lee, Vassilaros, et al., 197912. m/0.3 mm/0.34 μm, He, 2. K/min; Tstart: 50. C; Tend: 250. C

Lee's RI, non-polar column, custom temperature program

View large format table.

Column type Active phase I Reference Comment
CapillaryDB-5330.2Fuentes, Font, et al., 2007Column length: 60. m; Program: not specified
CapillaryHP-5MS355.43Cheng, Liu, et al., 200530. m/0.30 mm/0.25 μm, He; Program: 50 0C (2 min) 8 0C/min -> 120 0C (3 min) 10 0C/min -> 230 0C
CapillaryLM-5326.13Ré-Poppi and Santiago-Silva, 200530. m/0.25 mm/0.25 μm, He; Program: 60C(2min) => 15C/min => 180C => 5C/min => 280C (10min)
CapillaryUltra-1326.5Sremac, Skrbic, et al., 200550. m/0.32 mm/0.50 μm, Nitrogen; Program: 40-100 0C 3-15 0C/min -> 290 0C
CapillaryUltra-1330.5Sremac, Skrbic, et al., 200550. m/0.32 mm/0.50 μm, Nitrogen; Program: 40-100 0C 3-15 0C/min -> 290 0C
CapillaryDB-5330.5Lundstedt, Haglund, et al., 200330. m/0.25 mm/0.25 μm; Program: not specified
CapillaryLM-5326.39Ré-Poppi and Santiago-Silva, 200230. m/0.25 mm/0.25 μm, He; Program: 60C(2min) => 15C/min => 180C => 5C/min => 280C(5min)
CapillaryHP-5329.88Reckendorf, 199725. m/0.2 mm/0.11 μm, He; Program: 106C(0.2min) => 40C/min => 120C => 3C/min => 310C(10min)
CapillarySE-54332.59Chen, 1996Column length: 30. m; Column diameter: 0.25 mm; Program: not specified
CapillarySE-54329.78Guillen, Iglesias, et al., 1992Program: not specified
CapillaryCP Sil 8 CB331.1Bundt, Herbel, et al., 199150. m/0.25 mm/0.25 μm, He; Program: not specified
CapillaryCP Sil 8 CB332.6Bundt, Herbel, et al., 199150. m/0.25 mm/0.25 μm, He; Program: not specified
CapillaryDB-5326.51Takada, Onda, et al., 1990He; Program: 70C(2min) => 30C/min => 150C => 5C/min => 200C => 4C/min => 310C
CapillaryDB-5331.98Naikwadi, Charbonneau, et al., 1987Column length: 30. m; Column diameter: 0.32 mm; Program: not specified
CapillaryDB-5332.17Naikwadi, Charbonneau, et al., 1987Column length: 30. m; Column diameter: 0.32 mm; Program: not specified
CapillaryDB-5332.59Naikwadi, Charbonneau, et al., 1987Column length: 30. m; Column diameter: 0.32 mm; Program: not specified
CapillaryDB-5332.59Naikwadi, Charbonneau, et al., 1987Column length: 30. m; Column diameter: 0.32 mm; Program: not specified
CapillaryOV-101331.1Tucminen, Wickstrom, et al., 1986Program: not specified
CapillarySE-52332.59Shlyakhov, 1984Program: not specified

References

Weast and Grasselli, 1989
CRC Handbook of Data on Organic Compounds, 2nd Editon, Weast,R.C and Grasselli, J.G., ed(s)., CRC Press, Inc., Boca Raton, FL, 1989, 1. [all data]

Binns and Squire, 1962
Binns, E.H.; Squire, K.H., Trans. Faraday Soc., 1962, 58, 762. [all data]

Klemm, Reed, et al., 1957
Klemm, L.H.; Reed, D.; Lind, C.D., J. Org. Chem., 1957, 22, 739. [all data]

Kochetkov, Nifant'ev, et al., 1957
Kochetkov, N.K.; Nifant'ev, E.E.; Nesmeyanov, A.N., Cyclic Acetals of β-Oxoaldehydes and Their Use in Synthesis of Alkylnaphthalenes, Izv. Akad. Nauk S.S.S.R., 1957, 1957, 949-55. [all data]

Kutz, Nickels, et al., 1948
Kutz, W.M.; Nickels, J.E.; McGovern, J.J.; Corson, B.B., Catalytic Alkylation of Indan and 1,2,3,4-Tetrahydronaphthalene by Olefins Alcohols and Diethyl Ether, J. Am. Chem. Soc., 1948, 70, 4026. [all data]

Rocha, Lima, et al., 2008
Rocha, Marisa A.A.; Lima, Carlos F.R.A.C.; Santos, Luís M.N.B.F., Phase transition thermodynamics of phenyl and biphenyl naphthalenes, The Journal of Chemical Thermodynamics, 2008, 40, 9, 1458-1463, https://doi.org/10.1016/j.jct.2008.04.010 . [all data]

Schafer, Schweig, et al., 1973
Schafer, W.; Schweig, A.; Markl, G.; Heier, K.-H., Zur elektronenstruktur der lambda3- und lambda5-phosphanaphthaline--ungewohnlich grosse MO destabilisierungen, Tetrahedron Lett., 1973, 3743. [all data]

Zhang, Shen, et al., 2000
Zhang, M.-J.; Shen, S.-D.; Chen, S.-Y.; Sun, Y.-H., Analysis of heavy oil fractions in high-temperature coal tar by capillary gas chromatography/fourier transform infrared spectrometry, Chin. J. Chromatogr., 2000, 18, 3, 241-246. [all data]

Rostad and Pereira, 1986
Rostad, C.E.; Pereira, W.E., Kovats and Lee retention indices determined by gas chromatography/mass spectrometry for organic compounds of environmental interest, J. Hi. Res. Chromatogr. Chromatogr. Comm., 1986, 9, 6, 328-334, https://doi.org/10.1002/jhrc.1240090603 . [all data]

Oda, Ichikawa, et al., 1996
Oda, J.; Ichikawa, S.; Mori, T., Analysis of polycyclic aromatic hydrocarbons in airborne particulates by capillary GC/MS method with programmed temperature relative retention index, Bunseki Kagaku, 1996, 45, 9, 825-835, https://doi.org/10.2116/bunsekikagaku.45.825 . [all data]

Elizalde-González, Hutfliess, et al., 1996
Elizalde-González, M.P.; Hutfliess, M.; Hedden, K., Retention index system, adsorption characteristics, and sructure correlations of polycyclic aromatic hydrocarbons in fuels, J. Hi. Res. Chromatogr., 1996, 19, 6, 345-352, https://doi.org/10.1002/jhrc.1240190608 . [all data]

Wang, Hou, et al., 2007
Wang, G.; Hou, Z.; Sun, Y.; Liu, Y.; Xie, B.; Liu, S., Investigation of pyrolysis behavior of fenoxycarb using PY-GC-MS assisted with chemometric methods, Chem. Anal., 2007, 52, 141-156. [all data]

Marynowski, Pieta, et al., 2004
Marynowski, L.; Pieta, M.; Janeczek, J., Composition and source of polycyclic aromatic compounds in deposited dust from selected sites around the Upper Silesia, Poland, Geol. Q., 2004, 48, 2, 169-180. [all data]

Chen, Keeran, et al., 2002
Chen, P.H.; Keeran, W.S.; Van Ausdale, W.A.; Schindler, D.R.; Roberts, D.W., Application of Lee retention indices to the confirmation of tentatively identified compounds from GC/MS analysis of environmental samples, Technical paper, Analytical Services Division, Environmental ScienceEngineering, Inc, PO Box 1703, Gainesville, FL 32602, 2002, 11. [all data]

Wang, Jia, et al., 2000
Wang, J.; Jia, C.R.; Wong, C.K.; Wong, P.K., Characterization of polycyclic aromatic hydrocarbons created in lubricating oils, Water Air Soil Poll., 2000, 120, 3/4, 381-396, https://doi.org/10.1023/A:1005251618062 . [all data]

Piao, Chu, et al., 1999
Piao, M.; Chu, S.; Zheng, M.; Xu, X., Characterization of the combustion products of polyethylene, Chemosphere, 1999, 39, 9, 1497-1512, https://doi.org/10.1016/S0045-6535(99)00054-5 . [all data]

Durlak, Biswas, et al., 1998
Durlak, S.K.; Biswas, P.; Shi, J.; Bernhard, M.J., Characterization of polycyclic aromatic hydrocarbon particulate and gaseous emissions from polystyrene combustion, Environ. Sci. Technol., 1998, 32, 15, 2301-2307, https://doi.org/10.1021/es9709031 . [all data]

Chen, 1996
Chen, J., GC and GC/MS methods for the analysis of polycyclic aromatic hydrocarbon (PAH) in sediment of the grand canal of China, Toxicol. Environ. Chem., 1996, 54, 1-4, 69-73, https://doi.org/10.1080/02772249609358297 . [all data]

Knobloch and Engewald, 1993
Knobloch, T.; Engewald, W., Identification of some polar polycyclic compounds in emissions from brown-coal-fired residential stoves, J. Hi. Res. Chromatogr., 1993, 16, 4, 239-242, https://doi.org/10.1002/jhrc.1240160407 . [all data]

Bundt, Herbel, et al., 1991
Bundt, J.; Herbel, W.; Steinhart, H.; Franke, S.; Francke, W., Structure-type separation of diesel fuels by solid phase extraction and identification of the two- and three-ring aromatics by capillary GC-mass spectrometry, J. Hi. Res. Chromatogr., 1991, 14, 2, 91-98, https://doi.org/10.1002/jhrc.1240140205 . [all data]

Guillén, Blanco, et al., 1989
Guillén, M.D.; Blanco, J.; Bermejo, J.; Blanco, C.G., Temperature programmed retention indices of some PAHs on Capillary columns coated with OV-1701 and SE-54, J. Hi. Res. Chromatogr., 1989, 12, 8, 552-554, https://doi.org/10.1002/jhrc.1240120816 . [all data]

Sye, Lin, et al., 1988
Sye, W.-F.; Lin, C.-L.; Yen, D.-P.; Tsai, C.-S., Polycyclic aromatic-hydrocarbons formation from luel and additives combustion, J. Chinese Chem. Soc., 1988, 35, 1, 1-11. [all data]

Vassilaros, Kong, et al., 1982
Vassilaros, D.L.; Kong, R.C.; Later, D.W.; Lee, M.L., Linear retention index system for polycyclic aromatic compounds. Critical evaluation and additional indices, J. Chromatogr., 1982, 252, 1-20, https://doi.org/10.1016/S0021-9673(01)88394-1 . [all data]

Lee, Vassilaros, et al., 1979
Lee, M.L.; Vassilaros, D.L.; White, C.M.; Novotny, M., Retention Indices for Programmed-Temperature Capillary-Column Gas Chromatography of Polycyclic Aromatic Hydrocarbons, Anal. Chem., 1979, 51, 6, 768-773, https://doi.org/10.1021/ac50042a043 . [all data]

Fuentes, Font, et al., 2007
Fuentes, M.J.; Font, R.; Gomez-Rico, M.F.; Martin-Gullon, I., Pyrolysis and combustion of waste lubricant oil from diesel cars: Decomposition and pollutants, J. Anal. Appl. Pyrolysis, 2007, 79, 1-2, 215-226, https://doi.org/10.1016/j.jaap.2006.12.004 . [all data]

Cheng, Liu, et al., 2005
Cheng, D.-X.; Liu, B.-X.; Sun, Y.-A.; Xie, B.; Zhang, H.-L., rapid analysis of pyrolysis products of cholesterol by GC-MS assited with boiling point - Lee retention index, journal of Instrumental Analysis - Fenxi ceshi xuebao, 2005, 24, 6, 85-88. [all data]

Ré-Poppi and Santiago-Silva, 2005
Ré-Poppi, N.; Santiago-Silva, M., Polycyclic aromatic hydrocarbons and other selected organic compounds in ambient air of Campo Grande City, Brazil, Atmos. Environ., 2005, 39, 16, 2839-2850, https://doi.org/10.1016/j.atmosenv.2004.10.006 . [all data]

Sremac, Skrbic, et al., 2005
Sremac, S.; Skrbic, B.; Onjia, A., Artificial neural network prediction of quantitative structure-retention relationships of polycyclic aromatic hydrocarbons in gas chromatography, J. Serb. Chem. Soc., 2005, 70, 11, 1291-1300, https://doi.org/10.2298/JSC0511291S . [all data]

Lundstedt, Haglund, et al., 2003
Lundstedt, S.; Haglund, P.; Öberg, L., Degradation and formation of polycyclic aromatic compounds during bioslurry treatment of an aged gasworks soil, Environ. Toxicol. Chem., 2003, 22, 7, 1413-1420, https://doi.org/10.1002/etc.5620220701 . [all data]

Ré-Poppi and Santiago-Silva, 2002
Ré-Poppi, N.; Santiago-Silva, M.R., Identification of polycyclic aromatic hydrocarbons and methoxylated phenols in wood smoke emitted during production of charcoal, Chromatographia, 2002, 55, 7/8, 475-481, https://doi.org/10.1007/BF02492280 . [all data]

Reckendorf, 1997
Reckendorf, R.M., Identification of phenyl-substituted polycyclic aromatic compounds in ring furnace gases using GC-MS and GC-AED, Chromatographia, 1997, 45, 1, 173-182, https://doi.org/10.1007/BF02505557 . [all data]

Guillen, Iglesias, et al., 1992
Guillen, M.D.; Iglesias, M.J.; Dominguez, A.; Blanco, C.G., Polynuclear aromatic hydrocarbon retention indices on SE-54 stationary phase of the volatile components of a coal tar pitch. Relationships between chromatographic retention and thermal reactivity, J. Chromatogr., 1992, 591, 1-2, 287-295, https://doi.org/10.1016/0021-9673(92)80246-Q . [all data]

Takada, Onda, et al., 1990
Takada, H.; Onda, T.; Ogura, N., Determination of polycyclic aromatic hydrocarbons in urban street dusts and their source materials by capillary gas chromatography, Environ. Sci. Technol., 1990, 24, 8, 1179-1186, https://doi.org/10.1021/es00078a005 . [all data]

Naikwadi, Charbonneau, et al., 1987
Naikwadi, K.P.; Charbonneau, G.M.; Karasek, F.W.; Clement, R.E., Separation and Identification of Organic Compounds in Air Particulate Extracts by High-Performance Liquid Chromatography and Gas Chromatography-Mass Spectrometry, J. Chromatogr., 1987, 398, 227-237, https://doi.org/10.1016/S0021-9673(01)96508-2 . [all data]

Tucminen, Wickstrom, et al., 1986
Tucminen, A.; Wickstrom, K.; Pyysalo, H., Determination of Polycyclic Aromatic Compounds by GLC-Selected Ion Monitoring (SIM) Technique, J. Hi. Res. Chromatogr. Chromatogr. Comm., 1986, 9, 8, 469-471, https://doi.org/10.1002/jhrc.1240090813 . [all data]

Shlyakhov, 1984
Shlyakhov, A.F., Gas chromatography in organic geochemistry, Nedra, Moscow, 1984, 221. [all data]