Beryllium oxide

Gas phase thermochemistry data

Quantity Value Units Method Reference Comment
Δfgas-505.000kcal/molReviewChase, 1998Data last reviewed in September, 1963
Quantity Value Units Method Reference Comment
gas,1 bar77.266cal/mol*KReviewChase, 1998Data last reviewed in September, 1963

Gas Phase Heat Capacity (Shomate Equation)

Cp° = A + B*t + C*t2 + D*t3 + E/t2
H° − H°298.15= A*t + B*t2/2 + C*t3/3 + D*t4/4 − E/t + F − H
S° = A*ln(t) + B*t + C*t2/2 + D*t3/3 − E/(2*t2) + G
    Cp = heat capacity (cal/mol*K)
    H° = standard enthalpy (kcal/mol)
    S° = standard entropy (cal/mol*K)
    t = temperature (K) / 1000.

View plot Requires a JavaScript / HTML 5 canvas capable browser.

View table.

Temperature (K) 298. - 600.600. - 6000.
A -17.5834052.54479
B 200.54902.109591
C -225.1360-0.494100
D 95.608010.038171
E 0.181502-3.964291
F -506.2629-532.6240
G 6.375682121.9200
H -505.0000-505.0000
ReferenceChase, 1998Chase, 1998
Comment Data last reviewed in September, 1963 Data last reviewed in September, 1963

References

Chase, 1998
Chase, M.W., Jr., NIST-JANAF Themochemical Tables, Fourth Edition, J. Phys. Chem. Ref. Data, Monograph 9, 1998, 1-1951. [all data]