9,10-Dimethylenetricyclo[5.3.0.02,8]deca-3,5-diene

Gas phase ion energetics data

Data compiled by: Sharon G. Lias and Joel F. Liebman

Ionization energy determinations

IE (eV) Method Reference Comment
8.17PEGleiter, Toyota, et al., 1988
8.17PEGleiter, Toyota, et al., 1988Vertical value

References

Gleiter, Toyota, et al., 1988
Gleiter, R.; Toyota, A.; Bischof, P.; Krennrich, G.; Dressel, J.; Pansegrau, P.D.; Paquette, L.A., Photoelectron spectroscopic analysis of through-bond interaction via cyclobutane relay orbitals. Evidence for strong relay conjugation in tricyclo[5.5.0.02,8]dodecatetraene, J. Am. Chem. Soc., 1988, 110, 5490. [all data]