4-Hexen-1-ol

Normal alkane RI, polar column, custom temperature program

Data compiled by: NIST Mass Spectrometry Data Center, William E. Wallace, director

Column type Capillary
Active phase Nukol
Column length (m) 25.
Carrier gas N2
Substrate
Column diameter (mm) 0.25
Phase thickness (μm)
Program 45C(5min) => 20C/min => 100C(1min) => 3C/min => 190C(40min)
I 1373.
ReferenceLópez and Dufour, 2001
Comment MSDC-RI

References

López and Dufour, 2001
López, M.G.; Dufour, J.P., Chapter 6. Tequilas: charm analysis of Blanco, Teposado, and Anejo tequilas, Am. Chem. Soc. Symp. Ser., 2001, 782, 62-72. [all data]