2-Furanmethanol, tetrahydro-5-methyl-

Normal alkane RI, non-polar column, temperature ramp

View large format table.

Column type Active phase I Reference Comment
CapillaryDB-11075.Lu, Yu, et al., 199760. m/0.32 mm/1. μm, He, 40. C @ 2. min, 2. K/min, 280. C @ 40. min

References

Lu, Yu, et al., 1997
Lu, G.; Yu, T.-H.; Ho, C.-T., Generation of flavor compounds by the reaction of 2-deoxyglucose with selected amino acids, J. Agric. Food Chem., 1997, 45, 1, 233-236, https://doi.org/10.1021/jf960609c . [all data]