Naphthalene, 2-iodo-

Gas phase thermochemistry data

Data compiled by: Hussein Y. Afeefy, Joel F. Liebman, and Stephen E. Stein

Quantity Value Units Method Reference Comment
Δfgas235. ± 9.2kJ/molCcbSmith, 1956Heat of formation derived by Cox and Pilcher, 1970

Condensed phase thermochemistry data

Data compiled by: Hussein Y. Afeefy, Joel F. Liebman, and Stephen E. Stein

Quantity Value Units Method Reference Comment
Δfsolid34.5 ± 1.5kcal/molCcbSmith, 1956Heat of formation derived by Cox and Pilcher, 1970
Quantity Value Units Method Reference Comment
Δcsolid-1214.1 ± 1.5kcal/molCcbSmith, 1956Reanalyzed by Cox and Pilcher, 1970, Original value = -1213.3 ± 1.8 kcal/mol

References

Smith, 1956
Smith, L., Corrected heats of combustion of organic iodine compounds, Acta Chem. Scand., 1956, 10, 884-886. [all data]

Cox and Pilcher, 1970
Cox, J.D.; Pilcher, G., Thermochemistry of Organic and Organometallic Compounds, Academic Press, New York, 1970, 1-636. [all data]