Benzene,2-(1,1-dimethylethoxy)-1,3,5-trimethyl-

Gas phase ion energetics data

Data compiled by: Sharon G. Lias, Rhoda D. Levin, and Sherif A. Kafafi

Ionization energy determinations

IE (eV) Method Reference Comment
8.27PEFriege and Klessinger, 1979Vertical value

References

Friege and Klessinger, 1979
Friege, H.; Klessinger, M., Elektronenstruktur von Alkyl-aryl- und Alkyl-vinyl-ethern, Chem. Ber., 1979, 112, 1614. [all data]