1,3,2-Dithiastannolane,2,2-dibutyl-4-methyl-

Gas phase ion energetics data

Data compiled by: Sharon G. Lias, Rhoda D. Levin, and Sherif A. Kafafi

Ionization energy determinations

IE (eV) Method Reference Comment
7.65PEDelmas and Maire, 1978Vertical value

References

Delmas and Maire, 1978
Delmas, M.A.; Maire, J.C., Conformation du cycle dithia-1,3 stanna-2 cyclopentane: etude par RMN (1)H et par spectroscopie photoelectronique, J. Organomet. Chem., 1978, 161, 13. [all data]