Furan, 3-(ethyldithio)-2-methyl

Van Den Dool and Kratz RI, polar column, temperature ramp

View large format table.

Column type Active phase I Reference Comment
CapillaryDB-Wax1725.Ruther and Baltes, 199460. m/0.25 mm/0.25 μm, He, 35. C @ 5. min, 2. K/min, 210. C @ 30. min

Normal alkane RI, non-polar column, custom temperature program

View large format table.

Column type Active phase I Reference Comment
CapillaryDB-11238.Ruther and Baltes, 199460. m/0.32 mm/1.0 μm, He; Program: 35 0C (5 min), 2 0C/min to 150 0C, 3 0C/min to 260 0C (30 min)

References

Ruther and Baltes, 1994
Ruther, J.; Baltes, W., Sulfur-containing furans in commercial meat flavorings, J. Agric. Food Chem., 1994, 42, 10, 2254-2259, https://doi.org/10.1021/jf00046a032 . [all data]