2,2-Dichlorotrifluoroethyl 1,1,3-trichlorotetrafluoropropyl ether

Gas phase thermochemistry data

Data compiled by: Hussein Y. Afeefy, Joel F. Liebman, and Stephen E. Stein

Quantity Value Units Method Reference Comment
Δfgas-1752.5 ± 6.5kJ/molCcrKolesov, Erastov, et al., 1981Reanalyzed by Kolesov and Kozina, 1986, Original value = -1754. ± 4.6 kJ/mol

Condensed phase thermochemistry data

Data compiled by: Hussein Y. Afeefy, Joel F. Liebman, and Stephen E. Stein

Quantity Value Units Method Reference Comment
Δfliquid-1805. ± 4.6kJ/molCcrKolesov, Erastov, et al., 1981
Quantity Value Units Method Reference Comment
Δcliquid-1537. ± 4.6kJ/molCcrKolesov, Erastov, et al., 1981

References

Kolesov, Erastov, et al., 1981
Kolesov, V.P.; Erastov, P.A.; Bondarenko, K.K., Standard enthalpies of formation of certain halogenoethers, Russ. J. Phys. Chem. (Engl. Transl.), 1981, 55, 803-805. [all data]

Kolesov and Kozina, 1986
Kolesov, V.P.; Kozina, M.P., Thermochemistry of organic and organohalogen compounds, Russ. Chem. Rev., 1986, 55, 912. [all data]