Indium dimer

Gas phase ion energetics data

Data compiled as indicated in comments:
RDSH - Henry M. Rosenstock, Keith Draxl, Bruce W. Steiner, and John T. Herron
B - John E. Bartmess

Electron affinity determinations

EA (eV) Method Reference Comment
1.27 ± 0.10LPESGausa, Ganteför, et al., 1990EA=E(threshold), or upper bound to EA.; B

Ionization energy determinations

IE (eV) Method Reference Comment
5.8 ± 0.3EIDeMaria, Drowart, et al., 1959RDSH

References

Gausa, Ganteför, et al., 1990
Gausa, M.; Ganteför, G.; Lutz, H.O.; Meiwes-Broer, K.-H., Electronic Structure of Group III Heavy Element Clusters Studied by Photoelectron Spectroscopy, Int. J. Mass Spectrom. Ion Proc., 1990, 102, 227, https://doi.org/10.1016/0168-1176(90)80062-8 . [all data]

DeMaria, Drowart, et al., 1959
DeMaria, G.; Drowart, J.; Inghram, M.G., Thermodynamic study of InSb with a mass spectrometer, J. Chem. Phys., 1959, 31, 1076. [all data]