Benzoylformic acid

Gas phase thermochemistry data

Data compiled by: Hussein Y. Afeefy, Joel F. Liebman, and Stephen E. Stein

Quantity Value Units Method Reference Comment
Δfgas-92.90 ± 0.24kcal/molCcrSteele, Chirico, et al., 1991ΔHfusion = 19.4±0.6 kJ/mol

Condensed phase thermochemistry data

Data compiled as indicated in comments:
ALS - Hussein Y. Afeefy, Joel F. Liebman, and Stephen E. Stein
DH - Eugene S. Domalski and Elizabeth D. Hearing

Quantity Value Units Method Reference Comment
Δfsolid-116.45 ± 0.19kcal/molCcrSteele, Chirico, et al., 1991ΔHfusion = 19.4±0.6 kJ/mol; ALS
Quantity Value Units Method Reference Comment
Δcsolid-840.91 ± 0.17kcal/molCcrSteele, Chirico, et al., 1991ΔHfusion = 19.4±0.6 kJ/mol; Corresponding Δfsolid = -116.45 kcal/mol (simple calculation by NIST; no Washburn corrections); ALS

Constant pressure heat capacity of solid

Cp,solid (cal/mol*K) Temperature (K) Reference Comment
46.10298.15N/AT = 285 to 425 K. C/R(c) = 0.025T + 15.78 (285 to 338.9 K); C/R(liq) = 0.0411T + 17.67 (338.9 to 425 K), R = 8.31451 J/mol*K.; DH

Phase change data

Data compiled as indicated in comments:
TRC - Thermodynamics Research Center, NIST Boulder Laboratories, Chris Muzny director
DRB - Donald R. Burgess, Jr.
DH - Eugene S. Domalski and Elizabeth D. Hearing

Quantity Value Units Method Reference Comment
Tfus338.9KN/ASteele, Chirico, et al., 1991, 2Uncertainty assigned by TRC = 0.5 K; TRC
Quantity Value Units Method Reference Comment
Δsub23.5kcal/molN/ASteele, Chirico, et al., 1991DRB

Enthalpy of fusion

ΔfusH (kcal/mol) Temperature (K) Reference Comment
5.2103338.9N/ADH

In addition to the Thermodynamics Research Center (TRC) data available from this site, much more physical and chemical property data is available from the following TRC products:

References

Steele, Chirico, et al., 1991
Steele, W.V.; Chirico, R.D.; Nguyen, A.; Hossenlopp, I.A.; Smith, N.K., DIPPR PROJECT 871: Determination of ideal-gas enthalpies of formation for key compounds: The 1989 project results, J. Chem. Thermodyn., 1991, 101-134. [all data]

Steele, Chirico, et al., 1991, 2
Steele, W.V.; Chirico, R.D.; Nguyen, A.; Hossenlopp, I.A.; Smith, N.K., DIPPR Project 871: determination of ideal-gas enthalpies of formation for key compounds: the 1989 project results in DIPPR Data Ser. 1, 1991. [all data]