Isopropyl phenyl ketone

Phase change data

Data compiled by: Robert L. Brown and Stephen E. Stein

Quantity Value Units Method Reference Comment
Tboil490.2KN/AAldrich Chemical Company Inc., 1990

Reduced pressure boiling point

Tboil (K) Pressure (bar) Reference
493.20.995Weast and Grasselli, 1989
359.20.005Weast and Grasselli, 1989

Gas phase ion energetics data

Data compiled by: Michael M. Meot-Ner (Mautner)

Gas basicity at 298K

Gas basicity (review) (kJ/mol) Reference Comment
839.3Dell'Erba, Gruttadauria, et al., 2000T = 300K

Normal alkane RI, non-polar column, custom temperature program

View large format table.

Column type Active phase I Reference Comment
CapillarySE-301185.Vinogradov, 2004Program: not specified
CapillaryPolydimethyl siloxanes1174.Zenkevich and Chupalov, 1996Program: not specified

References

Aldrich Chemical Company Inc., 1990
Aldrich Chemical Company Inc., Catalog Handbook of Fine Chemicals, Aldrich Chemical Company, Inc., Milwaukee WI, 1990, 1. [all data]

Weast and Grasselli, 1989
CRC Handbook of Data on Organic Compounds, 2nd Editon, Weast,R.C and Grasselli, J.G., ed(s)., CRC Press, Inc., Boca Raton, FL, 1989, 1. [all data]

Dell'Erba, Gruttadauria, et al., 2000
Dell'Erba, C.; Gruttadauria, M.; Mugnoli, A.; Noto, R.; Novi, M.; Occhiucci, G.; Petrillo, G.; Spinelli, D., Gas-phase and solution basicities of some 2,6-dialkylphenyl ketones: A comparative analysis, Tetrahedron, 2000, 56, 4565. [all data]

Vinogradov, 2004
Vinogradov, B.A., Production, composition, properties and application of essential oils, 2004, retrieved from http://viness.narod.ru. [all data]

Zenkevich and Chupalov, 1996
Zenkevich, I.G.; Chupalov, A.A., New Possibilities of Chromato Mass Pectrometric Identification of Organic Compounds Using Increments of Gas Chromatographic Retention Indices of Molecular Structural Fragments, Zh. Org. Khim. (Rus.), 1996, 32, 5, 656-666. [all data]