Cyclohexan-3,5-d2-ol (1α,3β,5β)

Gas phase ion energetics data

Data compiled by: Sharon G. Lias, Rhoda D. Levin, and Sherif A. Kafafi

Appearance energy determinations

Ion AE (eV) Other Products MethodReferenceComment
C6H8D2+10.5 ± 0.10H2OEIGreen, Bafus, et al., 1975
C6H9D+11.3 ± 0.10HDOEIGreen, Bafus, et al., 1975
C6H8D2+10.5 ± 0.10H2OEIGreen, 1980Vertical value
C6H9D+11.3 ± 0.04DOHEIGreen, 1980Vertical value

References

Green, Bafus, et al., 1975
Green, M.M.; Bafus, D.; Franklin, J.L., Short communication; Combined deuterium labeling and appearance potential measurements to uncover competing reaction mechanisms in the electron- impact-induced loss of water from cyclohexanol, Org. Mass Spectrom., 1975, 10, 679. [all data]

Green, 1980
Green, M.M., A stereochemical bridge between mass spectrometry and free radical chemistry, Tetrahedron, 1980, 36, 2687. [all data]