Benzene, 1-(bromomethyl)-2-chloro-

Phase change data

Data compiled by: Robert L. Brown and Stephen E. Stein

Reduced pressure boiling point

Tboil (K) Pressure (bar) Reference
376.70.013Aldrich Chemical Company Inc., 1990

Normal alkane RI, non-polar column, custom temperature program

View large format table.

Column type Active phase I Reference Comment
CapillaryPolydimethyl siloxanes1237.Zenkevich, 2003Program: not specified
CapillaryMethyl Silicone1237.Zenkevich, 2001Program: not specified

References

Aldrich Chemical Company Inc., 1990
Aldrich Chemical Company Inc., Catalog Handbook of Fine Chemicals, Aldrich Chemical Company, Inc., Milwaukee WI, 1990, 1. [all data]

Zenkevich, 2003
Zenkevich, I.G., Criteria for Evaluation of Elution Order of Isomeric Organic Compounds, Zh. Phys. Khim. (Rus.), 2003, 77, 1, 92-98. [all data]

Zenkevich, 2001
Zenkevich, I.G., Interpretation of Gas Chromatographic Retention Indices in estimation of Structures of Isomeric Products of Radical Chlorinating of Alkyl Arenes, Zh. Org. Khim., 2001, 37, 2, 283-293. [all data]